67 69 w1 0f sf ud ox sj 2e nb d5 il tn 12 h5 83 1s 4u 4s kw h4 wu to ru yv jf dd 7x qd cm 9s 9b 68 wl vi 2n o8 9d nc m6 p8 d6 zm uv fq 3r uh dh gt fg 1v
1 d
67 69 w1 0f sf ud ox sj 2e nb d5 il tn 12 h5 83 1s 4u 4s kw h4 wu to ru yv jf dd 7x qd cm 9s 9b 68 wl vi 2n o8 9d nc m6 p8 d6 zm uv fq 3r uh dh gt fg 1v
WebJul 31, 2024 · After adding the /bin/ folder to my PATH, I tried calling gradle -v from both a command prompt and powershell. Windows didn't complain that it couldn't find any … WebWhen testing a Gradle project, you may receive the following Gradle error: >>> stderr: Error: Could not find or load main class org.gradle.wrapper.GradleWrapperMain Caused by: java.lang.ClassNotFoundException: org.gradle.wrapper.GradleWrapperMain ... batch script on windows and shell script elsewhere. The wrapper script, when invoked, … axis camera login page WebFix any errors or warnings that you find. For example, you might need to update a dependency version, add a missing plugin, or remove a conflicting setting. Once you've fixed all the errors and warnings, sync your project with Gradle by clicking the "Sync Now" button in the toolbar or by running the gradlew sync command in the terminal. WebApr 20, 2024 · Learn how to fix could not find gradle error in ionic. When you try to build your ionic project into an android app using Cordova in Windows, you may get an ... 3a ethanol WebTroubleshooting daemon connection issues. If your Gradle build fails before running any tasks, you may be encountering problems with your network configuration. When Gradle is unable to communicate with the Gradle … WebJul 18, 2024 · Home » Newcomers » Newcomers » i have errors on build gradle (help please) Show: Today's Messages :: Show Polls :: Message Navigator i have errors on build gradle [ message #1830168 ] axis camera ip utility mac WebLogging from external tools and libraries. Changing what Gradle logs. The log is the main 'UI' of a build tool. If it is too verbose, real warnings and problems are easily hidden by …
You can also add your opinion below!
What Girls & Guys Said
WebJun 28, 2024 · 1 Answer. jar () isn’t a method on Project. If I’m understanding your code correctly, what you are trying to do is configure the jar task that is created from the Java … WebMay 3, 2024 · I have so far: 1. deleted my .gradle under my user. 2. deleted my entire workspace and remade it. 3. redownloaded latest and recommended versions of forge. 4. had a go at giving Gradle more access through my firewall. 5. I verified that "C:\Program Files\AdoptOpenJDK\jdk-8.0.292.10-hotspot" exists. 6. axis camera login bypass WebFeb 1, 2024 · Caused by: org.gradle.launcher.daemon.client.DaemonConnectionException: The newly created daemon process has a different context than expected. It won't be possible to reconnect to this daemon. Context mismatch: Java home is different. WebJan 14, 2024 · from mainTemplate.gradle to launcherTemplate.gradle and it should work. You should activate these files first here in the Project Setting->Player->Publishing Settings. I solved it in two steps for Unity 2024.3.11f1: Go to Edit->Project Settings->Player->Publishing settings->Tick Custom Properties Gradle Template. 3 aesthetic words WebSep 9, 2024 · Expected Behavior When running ./gradlew tasks in a project dir, under the ubuntu bash shell in windows subsystem for linux, I expect it to run the task. Current Behavior ylm@wsl:~/myproject$ ./gradlew tasks ./gradlew: line 2: $'\r': com... WebDec 7, 2024 · Could not find an installed version of Gradle either in Android Studio,or on your system to install the gradle wrapper. Please include gradlein your path, or... axis camera login password WebFeb 1, 2024 · Caused by: org.gradle.launcher.daemon.client.DaemonConnectionException: The newly created daemon process has a different context than expected. It won't be …
WebJun 3, 2024 · I found the issue The source file path is: src\com\microsoft\office\officemobile\fragmentmanagerinfra\FragmentNavigationManager.java Generated Class file: intermediates\javac\release\compileReleaseJavaWithJavac\classes\com\microsoft\office\officemobile\FragmentManagerInfra\FragmentNavigationManager.class … WebI just migrated gradle from 3.0.1 to 4.4. Now Android Studio showing gradle build failed showing below errors. Caused by: org.gradle.internal.resolve.ModuleVersionNotFoundException: Could … 3 a events WebDec 14, 2016 · Oh I see. So my other question is, if I want this plugin to work for Android Studio, meaning that whenever. I press build on Android Studio my plugin will be able to get the gradle output, axis camera ip utility WebMay 4, 2016 · Thanks for contributing an answer to Stack Overflow! Please be sure to answer the question.Provide details and share your research! But avoid …. Asking for … WebApr 10, 2024 · Find installed Gradle version command; Run IntelliJ Java main method without Gradle build; Install Gradle VS Code for Java Projects; Fix: Invalid Gradle JDK configuration found. Could not find the required JavaSDK; Create a Gradle Java Project in VS Code; Generate Project Dependency tree using Gradle Command; How to Clear … 3a excellence of art WebLogging from external tools and libraries. Changing what Gradle logs. The log is the main 'UI' of a build tool. If it is too verbose, real warnings and problems are easily hidden by this. On the other hand you need relevant information for figuring out if things have gone wrong. Gradle defines 6 log levels, as shown in Log levels.
WebOct 10, 2024 · It would make instillation and management of Gradle on a Windows system much simpler. Standing up new systems, and onboarding new engineers, is much … 3a facility WebFeb 6, 2024 · They typically represent a problem with the developer’s inputs to the build such as the source code. To force classification of a build failure as a verification failure, prefix any exception message with any of the following phrases (case-insensitive) for verification failures. Analysis failed. Check failed. Compilation failed. 3a facilities in train